1 Reply Latest reply on May 5, 2014 10:31 AM by kknox

    Octave 8.3.1 using ACML 6 on Ubuntu 14.04 fails make check with segmentation fault.

    bsp2020

      Octave 8.3.1 using ACML 6 on Ubuntu 14.04 fails make check with segmentation fault.

      I'm still experimenting with GNU Octave 3.8.1 with ACML 6 on Ubuntu 14.04. make check which runs tests in Octave fails with segmentation fault. make check completes using the default BLAS library. Below is the part of the output that shows the error message.

       

       

       

        scripts/help/__makeinfo__.m ............................ PASS    1/1  

        scripts/help/__unimplemented__.m ....................... PASS    1/1  

        scripts/help/doc.m ..................................... PASS    1/1  

        scripts/help/doc_cache_create.m ........................ PASS    1/1  

        scripts/help/get_first_help_sentence.m ................. PASS    7/7  

        scripts/help/help.m .................................... PASS    2/2  

        scripts/help/print_usage.m ............................. PASS    1/1  

        scripts/help/type.m .................................... PASS    9/9  

        scripts/help/which.m ................................... PASS    3/3  

        scripts/image/cmpermute.m .............................. PASS   19/19 

        scripts/image/cmunique.m ............................... PASS   19/19 

        scripts/image/colormap.m ............................... PASS   11/11 

        scripts/image/contrast.m ............................... PASS    1/1  

        scripts/image/gray2ind.m ............................... PASS   16/16 

        scripts/image/hsv2rgb.m ................................ PASS   11/11 

        scripts/image/imformats.m .............................. PASS    4/4  

        scripts/image/imread.m .................................panic: Segmentation fault -- stopping myself...

      make[1]: *** [check] Segmentation fault (core dumped)

      make[1]: Leaving directory `/home/briansp/octave-3.8.1/test'

      make: *** [check] Error 2

       

      ACML 5 gives the following error.

       

        scripts/gui/guidata.m .................................. PASS    4/4  

        scripts/gui/uigetdir.m ................................. PASS    1/1  

        scripts/gui/uigetfile.m ................................ PASS    1/1  

        scripts/gui/uimenu.m ................................... PASS    3/3  

        scripts/gui/uiputfile.m ................................ PASS    1/1  

        scripts/gui/waitbar.m .................................. PASS    4/4  

        scripts/gui/waitforbuttonpress.m ....................... PASS    2/2  

        scripts/help/__makeinfo__.m ............................ PASS    1/1  

        scripts/help/__unimplemented__.m ....................... PASS    1/1  

        scripts/help/doc.m ..................................... PASS    1/1  

        scripts/help/doc_cache_create.m ........................ PASS    1/1  

        scripts/help/get_first_help_sentence.m ................. PASS    7/7  

        scripts/help/help.m .................................... PASS    2/2  

        scripts/help/print_usage.m ............................. PASS    1/1  

        scripts/help/type.m .................................... PASS    9/9  

        scripts/help/which.m ................................... PASS    3/3  

        scripts/image/cmpermute.m .............................. PASS   19/19 

        scripts/image/cmunique.m ............................... PASS   19/19 

        scripts/image/colormap.m ............................... PASS   11/11 

        scripts/image/contrast.m ............................... PASS    1/1  

        scripts/image/gray2ind.m ............................... PASS   16/16 

        scripts/image/hsv2rgb.m ................................ PASS   11/11 

        scripts/image/imformats.m .............................. PASS    4/4  

        scripts/image/imread.m ................................. : magick/pixel_cache.c:2787: ModifyCache: Assertion `image->cache != (Cache) ((void *)0)' failed.

      panic: Aborted -- stopping myself...

      make[1]: *** [check] Aborted (core dumped)

      make[1]: Leaving directory `/home/briansp/octave-3.8.1/test'

      make: *** [check] Error 2