7 Replies Latest reply on Mar 3, 2010 6:16 PM by omkaranathan

    ATI Stream SDK on Fedora 11 x86_64

    wldawn
      Problem with ATI Stream SDK Install

      Hello!

      I have download the ATI Stream SDK for 64bits. I follow the installation notes and I use make -j2 for compile.

      When I try this I adquire 2 errors. I believe are the same error for two files AESEncryptDecrypt.cpp and BinarySearch.cpp:

      Dans le fichier inclus à partir de BinarySearch.cpp:93:
      BinarySearch.hpp:96:19: erreur: CL/cl.h : Aucun fichier ou dossier de ce type
      In file included from BinarySearch.cpp:93:

      And a list the sentences not declared, but all are in CL/cl.h.

      Can you help me?

      Thanks.

        • ATI Stream SDK on Fedora 11 x86_64
          genaganna

           

          Originally posted by: wldawn Hello!

           

          I have download the ATI Stream SDK for 64bits. I follow the installation notes and I use make -j2 for compile.

           

          When I try this I adquire 2 errors. I believe are the same error for two files AESEncryptDecrypt.cpp and BinarySearch.cpp:

           

          Dans le fichier inclus à partir de BinarySearch.cpp:93: BinarySearch.hpp:96:19: erreur: CL/cl.h : Aucun fichier ou dossier de ce type In file included from BinarySearch.cpp:93:

           

          And a list the sentences not declared, but all are in CL/cl.h.

           

          Can you help me?

           

          Thanks.

           

          Please export ATISTREAMSDKROOT to installed directory.

            • ATI Stream SDK on Fedora 11 x86_64
              wldawn

              I did it and I obtain the same error.

              su -c 'export ATISTREAMSDKROOT=/usr/local/bin/ati-stream-sdk-v2.0-lnx64'

              su -c 'export ATISTREAMSDKSAMPLESROOT=/usr/local/bin/ati-stream-sdk-v2.0-lnx64'

              su -c 'export LD_LIBRARY_PATH=$ATISTREAMSDKROOT/lib/x86_64:$LD_LIBRARY_PATH'

              su -c 'ln -sf ./lib/x86_64/libatiocl64.so /usr/lib/OpenCL/vendors/libatiocl64.so'

              su -c 'make -j2'

                • ATI Stream SDK on Fedora 11 x86_64
                  wldawn

                  I have solve that problem but i can't finish the compile.

                  This is the result:

                  su -c 'make -j2'
                  Mot de passe :
                  make -C samples
                  make[1]: entrant dans le répertoire « /usr/local/bin/ati-stream-sdk-v2.0-lnx64/samples »
                  make -C opencl
                  make -C cal
                  make[2]: entrant dans le répertoire « /usr/local/bin/ati-stream-sdk-v2.0-lnx64/samples/opencl »
                  make -C SDKUtil
                  make[2]: entrant dans le répertoire « /usr/local/bin/ati-stream-sdk-v2.0-lnx64/samples/cal »
                  make -C app
                  make[3]: entrant dans le répertoire « /usr/local/bin/ati-stream-sdk-v2.0-lnx64/samples/opencl/SDKUtil »
                  mkdir -p build/debug/x86_64/
                  Building build/debug/x86_64//SDKApplication.o
                  g++ -Wfloat-equal -Wpointer-arith -DATI_OS_LINUX -g3 -ffor-scope -I ../../../include -I ../../../include -o build/debug/x86_64//SDKApplication.o -c SDKApplication.cpp
                  make[3]: entrant dans le répertoire « /usr/local/bin/ati-stream-sdk-v2.0-lnx64/samples/cal/app »
                  make -C cal_idct
                  make[4]: entrant dans le répertoire « /usr/local/bin/ati-stream-sdk-v2.0-lnx64/samples/cal/app/cal_idct »
                  mkdir -p build/debug/x86_64/
                  Building build/debug/x86_64//cal_idct.o
                  g++ -Wfloat-equal -Wpointer-arith -DATI_OS_LINUX -g3 -ffor-scope -I ../../../../include -I ../../common/ -o build/debug/x86_64//cal_idct.o -c cal_idct.cpp
                  mkdir -p build/debug/x86_64/
                  Building build/debug/x86_64//Timer.o
                  g++ -Wfloat-equal -Wpointer-arith -DATI_OS_LINUX -g3 -ffor-scope -I ../../../../include -I ../../common/ -o build/debug/x86_64//Timer.o -c ../../common/Timer.cpp
                  mkdir -p build/debug/x86_64/
                  Building build/debug/x86_64//Samples.o
                  g++ -Wfloat-equal -Wpointer-arith -DATI_OS_LINUX -g3 -ffor-scope -I ../../../../include -I ../../common/ -o build/debug/x86_64//Samples.o -c ../../common/Samples.cpp
                  mkdir -p build/debug/x86_64/
                  Building build/debug/x86_64//SDKBitMap.o
                  g++ -Wfloat-equal -Wpointer-arith -DATI_OS_LINUX -g3 -ffor-scope -I ../../../include -I ../../../include -o build/debug/x86_64//SDKBitMap.o -c SDKBitMap.cpp
                  install -D build/debug/x86_64/cal_idct ../../../../samples/cal/bin/x86_64/cal_idct
                  install: ne peut évaluer `build/debug/x86_64/cal_idct': Aucun fichier ou dossier de ce type
                  make[4]: *** [install] Erreur 1
                  make[4]: quittant le répertoire « /usr/local/bin/ati-stream-sdk-v2.0-lnx64/samples/cal/app/cal_idct »
                  make[3]: *** [cal_idct] Erreur 2
                  make[3]: quittant le répertoire « /usr/local/bin/ati-stream-sdk-v2.0-lnx64/samples/cal/app »
                  make[2]: *** [app] Erreur 2
                  make[2]: quittant le répertoire « /usr/local/bin/ati-stream-sdk-v2.0-lnx64/samples/cal »
                  make[1]: *** [cal] Erreur 2
                  make[1]: *** Attente des tâches non terminées....
                  make -C cl
                  make[3]: entrant dans le répertoire « /usr/local/bin/ati-stream-sdk-v2.0-lnx64/samples/opencl/cl »
                  make -C app
                  mkdir -p build/debug/x86_64/
                  Building build/debug/x86_64//SDKCommon.o
                  g++ -Wfloat-equal -Wpointer-arith -DATI_OS_LINUX -g3 -ffor-scope -I ../../../include -I ../../../include -o build/debug/x86_64//SDKCommon.o -c SDKCommon.cpp
                  make[4]: entrant dans le répertoire « /usr/local/bin/ati-stream-sdk-v2.0-lnx64/samples/opencl/cl/app »
                  make -C AESEncryptDecrypt
                  make[5]: entrant dans le répertoire « /usr/local/bin/ati-stream-sdk-v2.0-lnx64/samples/opencl/cl/app/AESEncryptDecrypt »
                  mkdir -p build/debug/x86_64/
                  Building build/debug/x86_64//AESEncryptDecrypt.o
                  g++ -Wfloat-equal -Wpointer-arith -DATI_OS_LINUX -g3 -ffor-scope -I ../../../../../include -o build/debug/x86_64//AESEncryptDecrypt.o -c AESEncryptDecrypt.cpp
                  mkdir -p build/debug/x86_64/
                  Building build/debug/x86_64//SDKCommandArgs.o
                  g++ -Wfloat-equal -Wpointer-arith -DATI_OS_LINUX -g3 -ffor-scope -I ../../../include -I ../../../include -o build/debug/x86_64//SDKCommandArgs.o -c SDKCommandArgs.cpp
                  install -D build/debug/x86_64/AESEncryptDecrypt ../../../../../samples/opencl/bin/x86_64/AESEncryptDecrypt
                  install: ne peut évaluer `build/debug/x86_64/AESEncryptDecrypt': Aucun fichier ou dossier de ce type
                  make[5]: *** [install] Erreur 1
                  make[5]: quittant le répertoire « /usr/local/bin/ati-stream-sdk-v2.0-lnx64/samples/opencl/cl/app/AESEncryptDecrypt »
                  make[4]: *** [AESEncryptDecrypt] Erreur 2
                  make[4]: quittant le répertoire « /usr/local/bin/ati-stream-sdk-v2.0-lnx64/samples/opencl/cl/app »
                  make[3]: *** [app] Erreur 2
                  make[3]: quittant le répertoire « /usr/local/bin/ati-stream-sdk-v2.0-lnx64/samples/opencl/cl »
                  make[2]: *** [cl] Erreur 2
                  make[2]: *** Attente des tâches non terminées....
                  mkdir -p build/debug/x86_64/
                  install -D build/debug/x86_64/libSDKUtil.a ../../../lib/x86_64/libSDKUtil.a
                  install: ne peut évaluer `build/debug/x86_64/libSDKUtil.a': Aucun fichier ou dossier de ce type
                  Building build/debug/x86_64//SDKFile.o
                  make[3]: *** [install] Erreur 1
                  make[3]: *** Attente des tâches non terminées....
                  g++ -Wfloat-equal -Wpointer-arith -DATI_OS_LINUX -g3 -ffor-scope -I ../../../include -I ../../../include -o build/debug/x86_64//SDKFile.o -c SDKFile.cpp
                  make[3]: quittant le répertoire « /usr/local/bin/ati-stream-sdk-v2.0-lnx64/samples/opencl/SDKUtil »
                  make[2]: *** [SDKUtil] Erreur 2
                  make[2]: quittant le répertoire « /usr/local/bin/ati-stream-sdk-v2.0-lnx64/samples/opencl »
                  make[1]: *** [opencl] Erreur 2
                  make[1]: quittant le répertoire « /usr/local/bin/ati-stream-sdk-v2.0-lnx64/samples »
                  make: *** [samples] Erreur 2

                    • ATI Stream SDK on Fedora 11 x86_64
                      genaganna

                       

                      Originally posted by: wldawn I have solve that problem but i can't finish the compile. This is the result:

                       

                      su -c 'make -j2' Mot de passe : make -C samples make[1]: entrant dans le répertoire « /usr/local/bin/ati-stream-sdk-v2.0-lnx64/samples » make -C opencl make -C cal make[2]: entrant dans le répertoire « /usr/local/bin/ati-stream-sdk-v2.0-lnx64/samples/opencl » make -C SDKUtil make[2]: entrant dans le répertoire « /usr/local/bin/ati-stream-sdk-v2.0-lnx64/samples/cal » make -C app make[3]: entrant dans le répertoire « /usr/local/bin/ati-stream-sdk-v2.0-lnx64/samples/opencl/SDKUtil » mkdir -p build/debug/x86_64/ Building build/debug/x86_64//SDKApplication.o g++ -Wfloat-equal -Wpointer-arith -DATI_OS_LINUX -g3 -ffor-scope -I ../../../include -I ../../../include -o build/debug/x86_64//SDKApplication.o -c SDKApplication.cpp make[3]: entrant dans le répertoire « /usr/local/bin/ati-stream-sdk-v2.0-lnx64/samples/cal/app » make -C cal_idct make[4]: entrant dans le répertoire « /usr/local/bin/ati-stream-sdk-v2.0-lnx64/samples/cal/app/cal_idct » mkdir -p build/debug/x86_64/ Building build/debug/x86_64//cal_idct.o g++ -Wfloat-equal -Wpointer-arith -DATI_OS_LINUX -g3 -ffor-scope -I ../../../../include -I ../../common/ -o build/debug/x86_64//cal_idct.o -c cal_idct.cpp mkdir -p build/debug/x86_64/ Building build/debug/x86_64//Timer.o g++ -Wfloat-equal -Wpointer-arith -DATI_OS_LINUX -g3 -ffor-scope -I ../../../../include -I ../../common/ -o build/debug/x86_64//Timer.o -c ../../common/Timer.cpp mkdir -p build/debug/x86_64/ Building build/debug/x86_64//Samples.o g++ -Wfloat-equal -Wpointer-arith -DATI_OS_LINUX -g3 -ffor-scope -I ../../../../include -I ../../common/ -o build/debug/x86_64//Samples.o -c ../../common/Samples.cpp mkdir -p build/debug/x86_64/ Building build/debug/x86_64//SDKBitMap.o g++ -Wfloat-equal -Wpointer-arith -DATI_OS_LINUX -g3 -ffor-scope -I ../../../include -I ../../../include -o build/debug/x86_64//SDKBitMap.o -c SDKBitMap.cpp install -D build/debug/x86_64/cal_idct ../../../../samples/cal/bin/x86_64/cal_idct install: ne peut évaluer `build/debug/x86_64/cal_idct': Aucun fichier ou dossier de ce type make[4]: *** [install] Erreur 1 make[4]: quittant le répertoire « /usr/local/bin/ati-stream-sdk-v2.0-lnx64/samples/cal/app/cal_idct » make[3]: *** [cal_idct] Erreur 2 make[3]: quittant le répertoire « /usr/local/bin/ati-stream-sdk-v2.0-lnx64/samples/cal/app » make[2]: *** [app] Erreur 2 make[2]: quittant le répertoire « /usr/local/bin/ati-stream-sdk-v2.0-lnx64/samples/cal » make[1]: *** [cal] Erreur 2 make[1]: *** Attente des tâches non terminées.... make -C cl make[3]: entrant dans le répertoire « /usr/local/bin/ati-stream-sdk-v2.0-lnx64/samples/opencl/cl » make -C app mkdir -p build/debug/x86_64/ Building build/debug/x86_64//SDKCommon.o g++ -Wfloat-equal -Wpointer-arith -DATI_OS_LINUX -g3 -ffor-scope -I ../../../include -I ../../../include -o build/debug/x86_64//SDKCommon.o -c SDKCommon.cpp make[4]: entrant dans le répertoire « /usr/local/bin/ati-stream-sdk-v2.0-lnx64/samples/opencl/cl/app » make -C AESEncryptDecrypt make[5]: entrant dans le répertoire « /usr/local/bin/ati-stream-sdk-v2.0-lnx64/samples/opencl/cl/app/AESEncryptDecrypt » mkdir -p build/debug/x86_64/ Building build/debug/x86_64//AESEncryptDecrypt.o g++ -Wfloat-equal -Wpointer-arith -DATI_OS_LINUX -g3 -ffor-scope -I ../../../../../include -o build/debug/x86_64//AESEncryptDecrypt.o -c AESEncryptDecrypt.cpp mkdir -p build/debug/x86_64/ Building build/debug/x86_64//SDKCommandArgs.o g++ -Wfloat-equal -Wpointer-arith -DATI_OS_LINUX -g3 -ffor-scope -I ../../../include -I ../../../include -o build/debug/x86_64//SDKCommandArgs.o -c SDKCommandArgs.cpp install -D build/debug/x86_64/AESEncryptDecrypt ../../../../../samples/opencl/bin/x86_64/AESEncryptDecrypt install: ne peut évaluer `build/debug/x86_64/AESEncryptDecrypt': Aucun fichier ou dossier de ce type make[5]: *** [install] Erreur 1 make[5]: quittant le répertoire « /usr/local/bin/ati-stream-sdk-v2.0-lnx64/samples/opencl/cl/app/AESEncryptDecrypt » make[4]: *** [AESEncryptDecrypt] Erreur 2 make[4]: quittant le répertoire « /usr/local/bin/ati-stream-sdk-v2.0-lnx64/samples/opencl/cl/app » make[3]: *** [app] Erreur 2 make[3]: quittant le répertoire « /usr/local/bin/ati-stream-sdk-v2.0-lnx64/samples/opencl/cl » make[2]: *** [cl] Erreur 2 make[2]: *** Attente des tâches non terminées.... mkdir -p build/debug/x86_64/ install -D build/debug/x86_64/libSDKUtil.a ../../../lib/x86_64/libSDKUtil.a install: ne peut évaluer `build/debug/x86_64/libSDKUtil.a': Aucun fichier ou dossier de ce type Building build/debug/x86_64//SDKFile.o make[3]: *** [install] Erreur 1 make[3]: *** Attente des tâches non terminées.... g++ -Wfloat-equal -Wpointer-arith -DATI_OS_LINUX -g3 -ffor-scope -I ../../../include -I ../../../include -o build/debug/x86_64//SDKFile.o -c SDKFile.cpp make[3]: quittant le répertoire « /usr/local/bin/ati-stream-sdk-v2.0-lnx64/samples/opencl/SDKUtil » make[2]: *** [SDKUtil] Erreur 2 make[2]: quittant le répertoire « /usr/local/bin/ati-stream-sdk-v2.0-lnx64/samples/opencl » make[1]: *** [opencl] Erreur 2 make[1]: quittant le répertoire « /usr/local/bin/ati-stream-sdk-v2.0-lnx64/samples » make: *** [samples] Erreur 2

                       

                      Wldawn,

                                We are not able to understand what errors you are getting. Please copy error in English. 

                      As a side note : Fedora 11 is not supported yet.